{"text_format":"1","workbook":"xlsx","n_sheets":4,"sheets":["Uitleg | Explanation","Veldenlijst (NL)","List of Fields (EN)","GPC"],"not_rendered":{"charts":0,"images":6,"macros":1,"external_links":1,"defined_names":29,"comments":0,"pivot_tables":0},"unopened":[],"bounds":{"document_bytes":16777216,"sheet_cells":100000,"rows_first":2000,"rows_last":500,"rows_between":2000,"halvings":0,"cell_chars":16384,"cell_head_chars":4096},"cells_cut":0,"cells_raw":0,"read":"whole","date_system":"1900"}

{"sheet":"Uitleg | Explanation","index":0,"n_rows":57,"n_cols":19,"rows_kept":57,"cut":false,"hidden":false,"merged":[]}
[null," ","GS1 Data Source - Overzicht datavelden GDSN 3.1.23 - Levensmiddelen & drogisterij",null,null,null,null,null,null,null,null,null,null,null,null,null,null,null,"Versie: 3.1.23       Datum: 20-05-2023"]
[1,2,"voor de levensmiddelen- en drogisterijsector",4,5,6,7,8,9,10,11,12,12,12,12,12,12,12,12]
[]
[null,"In dit document vindt u welke velden er ingevuld moeten of kunnen worden om productdata uit te wisselen via GS1 Data Source. In deze tab staat een uitleg hoe u deze kunt gebruiken."]
[null,"Er is een tab met de Nederlandse veldenlijst (Veldenlijst (NL)) en een tab met een Engelstalige versie (List of Fields (EN))."]
[null,"In this document you will find which fields have to or could be filled to exchange product data via GS1 Data Source. In this tab you find an explanation on how to use this. "]
[null,"There is a tab with the Dutch list of fields (Veldenlijst (NL)) and a tab with an English version (List of Fields (EN))."]
["TAB: Veldenlijst (NL)"]
[null,"Wat staat er in welke kolom? "]
[null,"Veldnaam - de naam van het veld dat ingevuld kan/moet worden"]
[null,"GDSN-naam - de naam van het veld in GDSN (de internationale standaard die wordt gebruikt om data te kunnen delen)"]
[null,"DMS controle - de inhoud van dit veld wordt op juistheid gecontroleerd door een Data Management Service"]
[null,"BMS ID - uniek nummer om elk veld per module uniek te identificeren binnen GDSN "]
[null,"Formaat - in welk formaat het veld gevuld moet worden, bijv. via een codelijst "]
[null,"X Path - een tekstuele weergave van de exacte locatie van het veld in het GDSN XML-schema"]
[null,"GDM laag - in welke laag het veld hoort in het Global Data Model"]
[null,"Verplichting - of en wanneer een veld verplicht is om te vullen"]
[null,"Vanaf kolom K - een overzicht van de categorieën waar dit veld op van toepassing is "]
[]
[null,"Zoeken in veldenlijst"]
{"$rows_left_out":38}
{"sheet":"Veldenlijst (NL)","index":1,"n_rows":488,"n_cols":51,"rows_kept":488,"cut":false,"hidden":false,"merged":[]}
[{"$f":"'Uitleg | Explanation'!S1","v":"Versie: 3.1.23       Datum: 20-05-2023"},null,null,null,"Basis →  ̶",null,null,null,"+ ← Uitgebreid","Geen Velden/Type →  ̶",null,null,null,null,null,null,null,null,null,null,null,null,null,null,null,null,null,null,null,"+ ← Velden/Type"]
["Global Data Model Product category",{"$f":"IF(LEN(B3)>1,VLOOKUP(B3,GPC!A2:B21,2,FALSE),_xlfn.IFNA(VLOOKUP(B4,5,FALSE),\"No specific group\"))","v":"No specific group"}]
["Productgroep",null,null,null,null,null,null,null,null,null,null,null,null,null,null,null,null,null,null,null,null,null,null,null,null,null,null,null,null,null,null,"Filtercriteria voor geavanceerd filteren"]
["GPC"]
["Basis/Uitgebreid","Druk op + of - boven kolom J en/of AE",null,{"$f":"_xlfn.IFNA(VLOOKUP(B3,2,FALSE),\"\")","v":""}]
[]
[]
["Veldnaam","GDSN-naam","DMS controle","BMS ID","Formaat","X Path","GDM laag","Verplichting","GAE ID","Dairy, Refrigerated & Frozen","Deli & Prepared","Fresh Meat","Fresh Fish","Fresh Fruits & Vegetables","Grocery","Cleaners","Disposables","Beauty & Personal Care","Petfood","Alcoholic Beverages","Tobacco","Self-care medicines","Special Food","Food Supplements","Healthcare Products","Medical Devices","Batteries","Light Bulbs","Other Categories",null,"Kolom1","Dairy, Refrigerated & Frozen","Deli & Prepared","Fresh Meat","Fresh Fish","Fresh Fruits & Vegetables","Grocery","Cleaners","Disposables","Beauty & Personal Care","Petfood","Alcoholic Beverages","Tobacco","Medicines","Special Food","Food Supplements","Healthcare Products","Medical Devices","Batteries","Light Bulbs","Other Categories"]
[null,null,null,null,null,{"$error":"#N/A"},null,null,null,"A","B","C","D","E","F","G","H","I","J","K","L","M","N","O","P","Q","R","S","T",null,null,{"$f":"_xlfn.IFNA(HLOOKUP('Veldenlijst (NL)'!$B$2,'Veldenlijst (NL)'!$J$8:$AC$9,2,FALSE),\"\")","v":""}]
["Algemene en logistieke informatie",null,"",null,"","",null,null,null,"A","B","C","D","E","F","G","H","I","J","K","L","M","N","O","P","Q","R","S","T",null,null,null,""]
["Algemene informatie",null,"",null,"","",null,null,null,"A","B","C","D","E","F","G","H","I","J","K","L","M","N","O","P","Q","R","S","T",null,null,null,null,""]
["GS1 locatiecode (GLN) dataleverancier (gln)","gln",0,83,"n13","/catalogue_item_notification:catalogueItemNotificationMessage/transaction/documentCommand/catalogue_item_notification:catalogueItemNotification/catalogueItem/tradeItem/informationProviderOfTradeItem/gln","Global","Verplicht","ANL1001","A","B","C","D","E","F","G","H","I","J","K","L","M","N","O","P","Q","R","S","T",null,null,null,null,null,""]
["Naam dataleverancier (partyName)","partyName",0,85,"an..200","/catalogue_item_notification:catalogueItemNotificationMessage/transaction/documentCommand/catalogue_item_notification:catalogueItemNotification/catalogueItem/tradeItem/informationProviderOfTradeItem/partyName","Global",0,"ANL1002","A","B","C","D","E","F","G","H","I","J","K","L","M","N","O","P","Q","R","S","T",null,null,null,null,null,null,""]
["GS1 artikelcode (GTIN) (gtin)","gtin",0,67,"n14","/catalogue_item_notification:catalogueItemNotificationMessage/transaction/documentCommand/catalogue_item_notification:catalogueItemNotification/catalogueItem/tradeItem/gtin","Global","Verplicht","ANL1003","A","B","C","D","E","F","G","H","I","J","K","L","M","N","O","P","Q","R","S","T",null,null,null,null,null,null,null,""]
["Code doelmarkt (targetMarketCountryCode)","targetMarketCountryCode",0,112,"Defined values","/catalogue_item_notification:catalogueItemNotificationMessage/transaction/documentCommand/catalogue_item_notification:catalogueItemNotification/catalogueItem/tradeItem/targetMarket/targetMarketCountryCode","Global","Verplicht","ANL1004","A","B","C","D","E","F","G","H","I","J","K","L","M","N","O","P","Q","R","S","T",null,null,null,null,null,null,null,null,""]
["Code GPC Classificatie (gpcCategoryCode)","gpcCategoryCode","X",161,"n8","/catalogue_item_notification:catalogueItemNotificationMessage/transaction/documentCommand/catalogue_item_notification:catalogueItemNotification/catalogueItem/tradeItem/gDSNTradeItemClassification/gpcCategoryCode","Global","Verplicht","ANL1005","A","B","C","D","E","F","G","H","I","J","K","L","M","N","O","P","Q","R","S","T",null,null,null,null,null,null,null,null,null,""]
["Code niveau producthiërarchie (tradeItemUnitDescriptorCode)","tradeItemUnitDescriptorCode",0,66,"Defined values","/catalogue_item_notification:catalogueItemNotificationMessage/transaction/documentCommand/catalogue_item_notification:catalogueItemNotification/catalogueItem/tradeItem/tradeItemUnitDescriptorCode","Global","Verplicht","ANL1006","A","B","C","D","E","F","G","H","I","J","K","L","M","N","O","P","Q","R","S","T",null,null,null,null,null,null,null,null,null,null,""]
["Code type display (displayTypeCode)","displayTypeCode",0,149,"Defined values","/catalogue_item_notification:catalogueItemNotificationMessage/transaction/documentCommand/catalogue_item_notification:catalogueItemNotification/catalogueItem/tradeItem/displayUnitInformation/displayTypeCode","Local","Verplicht als de consumenteneenheid een display is.","ANL1007","A","B","-","-","E","F","G","H","I","J","K","L","M","N","O","P","Q","R","S","T",null,null,null,null,null,null,null,null,null,null,null,""]
["Productinformatie ingangsdatum/tijd (effectiveDateTime)","effectiveDateTime",0,144,"DateTime","/catalogue_item_notification:catalogueItemNotificationMessage/transaction/documentCommand/catalogue_item_notification:catalogueItemNotification/catalogueItem/tradeItem/tradeItemSynchronisationDates/effectiveDateTime","Global","Verplicht","ANL1008","A","B","C","D","E","F","G","H","I","J","K","L","M","N","O","P","Q","R","S","T",null,null,null,null,null,null,null,null,null,null,null,null,""]
["GS1 locatiecode (GLN) lokaal contact (gln)","gln",0,128,"n13","/catalogue_item_notification:catalogueItemNotificationMessage/transaction/documentCommand/catalogue_item_notification:catalogueItemNotification/catalogueItem/tradeItem/tradeItemContactInformation/gln","Local"," ","ANL1009","A","B","C","D","E","F","G","H","I","J","K","L","M","N","O","P","Q","R","S","T",null,null,null,null,null,null,null,null,null,null,null,null,null,""]
{"$rows_left_out":469}
{"sheet":"List of Fields (EN)","index":2,"n_rows":488,"n_cols":51,"rows_kept":488,"cut":false,"hidden":false,"merged":[]}
[{"$f":"'Uitleg | Explanation'!S1","v":"Versie: 3.1.23       Datum: 20-05-2023"},null,null,null,"Basic →  ̶",null,null,null,"+ ← Advanced","No Fields/Cat →  ̶",null,null,null,null,null,null,null,null,null,null,null,null,null,null,null,null,null,null,null,"+ ← Fields/Cat"]
["Global Data Model Product category",{"$f":"IF(LEN(B3)>1,B3,_xlfn.IFNA(VLOOKUP(B4,5,FALSE),\"No specific group\"))","v":"No specific group"}]
["Product\ncategory",null,null,null,null,null,null,null,null,null,null,null,null,null,null,null,null,null,null,null,null,null,null,null,null,null,null,null,null,null,null,null,null,null,null,null,null,null,null,null,"Filter criteria for advanced filtering"]
["GPC"]
["Basic / Advanced","Press + or - above columns J or AE"]
[]
[]
["Field name","GDSN name","DMS  check","BMS ID","Format","X Path","GDM layer","Condition"," ","Dairy, Refrigerated & Frozen","Deli & Prepared","Fresh Meat","Fresh Fish","Fresh Fruits & Vegetables","Grocery","Cleaners","Disposables","Beauty & Personal Care","Petfood","Alcoholic Beverages","Tobacco","Self-care medicines","Special Food","Food Supplements","Healthcare Products","Medical Devices","Batteries","Light Bulbs","Other Categories",null,"Kolom1","Dairy, Refrigerated & Frozen","Deli & Prepared","Fresh Meat","Fresh Fish","Fresh Fruits & Vegetables","Grocery","Cleaners","Disposables","Beauty & Personal Care","Petfood","Alcoholic Beverages","Tobacco","Medicines","Special Food","Food Supplements","Healthcare Products","Medical Devices","Batteries","Light Bulbs","Other Categories"]
[null,null,null,null,null,{"$error":"#N/A"},null,null,null,"A","B","C","D","E","F","G","H","I","J","K","L","M","N","O","P","Q","R","S","T",null,null,{"$f":"_xlfn.IFNA(HLOOKUP('List of Fields (EN)'!$B$2,'List of Fields (EN)'!$J$8:$AC$9,2,FALSE),\"\")","v":""}]
["General and logistic information",null,"",null,"","",null,null,null,"A","B","C","D","E","F","G","H","I","J","K","L","M","N","O","P","Q","R","S","T",null,null,null,""]
["General information",null,"",null,"","",null,null,null,"A","B","C","D","E","F","G","H","I","J","K","L","M","N","O","P","Q","R","S","T",null,null,null,null,""]
["Information provider (GLN) (gln)","gln",0,83,"n13","/catalogue_item_notification:catalogueItemNotificationMessage/transaction/documentCommand/catalogue_item_notification:catalogueItemNotification/catalogueItem/tradeItem/informationProviderOfTradeItem/gln","Global","Mandatory",null,"A","B","C","D","E","F","G","H","I","J","K","L","M","N","O","P","Q","R","S","T",null,null,null,null,null,""]
["Name of information provider (partyName)","partyName",0,85,"an..200","/catalogue_item_notification:catalogueItemNotificationMessage/transaction/documentCommand/catalogue_item_notification:catalogueItemNotification/catalogueItem/tradeItem/informationProviderOfTradeItem/partyName","Global"," ",null,"A","B","C","D","E","F","G","H","I","J","K","L","M","N","O","P","Q","R","S","T",null,null,null,null,null,null,""]
["GTIN (Global Trade Item Number) (gtin)","gtin",0,67,"n14","/catalogue_item_notification:catalogueItemNotificationMessage/transaction/documentCommand/catalogue_item_notification:catalogueItemNotification/catalogueItem/tradeItem/gtin","Global","Mandatory",null,"A","B","C","D","E","F","G","H","I","J","K","L","M","N","O","P","Q","R","S","T",null,null,null,null,null,null,null,""]
["Target market country code (targetMarketCountryCode)","targetMarketCountryCode",0,112,"Defined values","/catalogue_item_notification:catalogueItemNotificationMessage/transaction/documentCommand/catalogue_item_notification:catalogueItemNotification/catalogueItem/tradeItem/targetMarket/targetMarketCountryCode","Global","Mandatory",null,"A","B","C","D","E","F","G","H","I","J","K","L","M","N","O","P","Q","R","S","T",null,null,null,null,null,null,null,null,""]
["GPC classification category code (gpcCategoryCode)","gpcCategoryCode","X",161,"n8","/catalogue_item_notification:catalogueItemNotificationMessage/transaction/documentCommand/catalogue_item_notification:catalogueItemNotification/catalogueItem/tradeItem/gDSNTradeItemClassification/gpcCategoryCode","Global","Mandatory",null,"A","B","C","D","E","F","G","H","I","J","K","L","M","N","O","P","Q","R","S","T",null,null,null,null,null,null,null,null,null,""]
["Trade item unit descriptor (tradeItemUnitDescriptorCode)","tradeItemUnitDescriptorCode",0,66,"Defined values","/catalogue_item_notification:catalogueItemNotificationMessage/transaction/documentCommand/catalogue_item_notification:catalogueItemNotification/catalogueItem/tradeItem/tradeItemUnitDescriptorCode","Global","Mandatory",null,"A","B","C","D","E","F","G","H","I","J","K","L","M","N","O","P","Q","R","S","T",null,null,null,null,null,null,null,null,null,null,""]
["Display type code (displayTypeCode)","displayTypeCode",0,149,"Defined values","/catalogue_item_notification:catalogueItemNotificationMessage/transaction/documentCommand/catalogue_item_notification:catalogueItemNotification/catalogueItem/tradeItem/displayUnitInformation/displayTypeCode","Local","Mandatory if it's a display.",null,"A","B","-","-","E","F","G","H","I","J","K","L","M","N","O","P","Q","R","S","T",null,null,null,null,null,null,null,null,null,null,null,""]
["Effective date time (effectiveDateTime)","effectiveDateTime",0,144,"DateTime","/catalogue_item_notification:catalogueItemNotificationMessage/transaction/documentCommand/catalogue_item_notification:catalogueItemNotification/catalogueItem/tradeItem/tradeItemSynchronisationDates/effectiveDateTime","Global","Mandatory",null,"A","B","C","D","E","F","G","H","I","J","K","L","M","N","O","P","Q","R","S","T",null,null,null,null,null,null,null,null,null,null,null,null,""]
["Contact information GLN (Global Location Number) (gln)","gln",0,128,"n13","/catalogue_item_notification:catalogueItemNotificationMessage/transaction/documentCommand/catalogue_item_notification:catalogueItemNotification/catalogueItem/tradeItem/tradeItemContactInformation/gln","Local"," ",null,"A","B","C","D","E","F","G","H","I","J","K","L","M","N","O","P","Q","R","S","T",null,null,null,null,null,null,null,null,null,null,null,null,null,""]
{"$rows_left_out":469}
{"sheet":"GPC","index":3,"n_rows":1034,"n_cols":7,"rows_kept":1034,"cut":false,"hidden":true,"merged":[]}
["Alle soorten producten","All product categories","Brick","GPC brick naam (NL)","GDM product type (NL)","GPC brick name (EN)","GDM product category (EN)"]
["Zuivel, gekoelde en bevroren producten","Dairy, Refrigerated & Frozen",10000002,"Fruit – Onbewerkt/Onverwerkt (Diepvries)","Aardappelen, groente en fruit (vers)"," ","Fresh Fruits & Vegetables"]
["Delicatessen en bereide producten","Deli & Prepared",10000003,"Fruit – Onbewerkt/Onverwerkt (Houdbaar)","Aardappelen, groente en fruit (vers)","Fruit – Unprepared/Unprocessed (Shelf Stable)","Fresh Fruits & Vegetables"]
["Vlees (vers)","Fresh Meat",10000005,"Groenten – Onbewerkt/Onverwerkt (Diepvries)","Aardappelen, groente en fruit (vers)","Vegetables – Unprepared/Unprocessed (Frozen)","Fresh Fruits & Vegetables"]
["Vis (vers)","Fresh Fish",10000006,"Groenten – Onbewerkt/Onverwerkt (Houdbaar)","Aardappelen, groente en fruit (vers)","Vegetables – Unprepared/Unprocessed (Shelf Stable)","Fresh Fruits & Vegetables"]
["Aardappelen, groente en fruit (vers)","Fresh Fruits & Vegetables",10000007,"Noten/Zaadjes – Onbewerkt/Onverwerkt (Vers)","Aardappelen, groente en fruit (vers)","Nuts/Seeds – Unprepared/Unprocessed (Perishable)","Fresh Fruits & Vegetables"]
["Kruidenierswaren","Grocery",10000008,"Noten/Zaadjes - Onbewerkt/Onverwerkt (In Pel/Schil)","Aardappelen, groente en fruit (vers)","Nuts/Seeds – Unprepared/Unprocessed (Shelf Stable)","Fresh Fruits & Vegetables"]
["Schoonmaakartikelen","Cleaners",10000016,"Vis – Bereid/Bewerkt (Beperkt Houdbaar)","Vis (vers)","Fish – Prepared/Processed (Perishable)","Fresh Fish"]
["Wegwerpartikelen","Disposables",10000017,"Vis – Bereid/Bewerkt (Diepvries)","Vis (vers)","Fish – Prepared/Processed (Frozen)","Fresh Fish"]
["Cosmetica en persoonlijke verzorgingsproducten","Beauty & Personal Care",10000018,"Vis – Bereid/Bewerkt (Houdbaar)","Vis (vers)","Fish – Prepared/Processed (Shelf Stable)","Fresh Fish"]
["Diervoeding","Petfood",10000019,"Schaal–/Schelpdieren – Niet–bereid/Niet–bewerkt (Beperkt Houdbaar)","Vis (vers)","Shellfish – Unprepared/Unprocessed (Perishable)","Fresh Fish"]
["Alcoholische dranken","Alcoholic Beverages",10000020,"Schaal–/Schelpdieren – Niet–bereid/Niet–bewerkt (Diepvries)","Vis (vers)","Shellfish – Unprepared/Unprocessed (Frozen)","Fresh Fish"]
["Tabakswaren","Tobacco",10000021,"Schaal–/Schelpdieren – Niet–bereid/Niet–bewerkt (Houdbaar)","Vis (vers)","Shellfish – Unprepared/Unprocessed (Shelf Stable)","Fresh Fish"]
["Zelfzorggeneesmiddelen","Self-care medicines",10000025,"Melk (Beperkt Houdbaar)","Zuivel, gekoeld & diepvries","Milk (Perishable)","Dairy, Refrigerated & Frozen"]
["Bijzondere voedingsmiddelen","Special food",10000026,"Melk (Houdbaar)","Zuivel, gekoeld & diepvries","Milk (Shelf Stable)","Dairy, Refrigerated & Frozen"]
["Voedingssupplementen","Food supplements",10000027,"Melk (Diepvries)","Zuivel, gekoeld & diepvries","Milk (Frozen)","Dairy, Refrigerated & Frozen"]
["Gezondheidsproducten, cosmetica en persoonlijke verzorgingsproducten","Healthcare products, cosmetics and personal care",10000028,"Kaas (Beperkt Houdbaar)","Zuivel, gekoeld & diepvries","Cheese (Perishable)","Dairy, Refrigerated & Frozen"]
["Medische hulpmiddelen","Medical devices",10000029,"Kaas (Houdbaar)","Zuivel, gekoeld & diepvries","Cheese (Shelf Stable)","Dairy, Refrigerated & Frozen"]
["Batterijen","Batteries",10000030,"Kaas (Diepvries)","Zuivel, gekoeld & diepvries","Cheese (Frozen)","Dairy, Refrigerated & Frozen"]
["Lampen","Light bulbs",10000040,"Eetbare Oliën – Plantaardig (Houdbaar)","Kruidenierswaren","Oils Edible – Vegetable or Plant (Shelf Stable)","Grocery"]
{"$rows_left_out":1014}